Reaction Details
TargetProtein mono-ADP-ribosyltransferase PARP15
LigandBDBM50079614
Substrate/Competitorn/a
Meas. Tech.ChEMBL_1472394 (CHEMBL3420115)
IC50 2300±n/a nM
Citation Ekblad, TLindgren, AEAndersson, CDCaraballo, RThorsell, AGKarlberg, TSpjut, SLinusson, ASchüler, HElofsson, M Towards small molecule inhibitors of mono-ADP-ribosyltransferases. Eur J Med Chem95:546-51 (2015) 
 
Protein mono-ADP-ribosyltransferase PARP15
Name:Protein mono-ADP-ribosyltransferase PARP15
Type:n/a
Mol. Mass.:74595.89
Organism:Homo sapiens (Human)
Description:Q460N3
Residue:678
BDBM50079614
NameBDBM50079614
Synonyms:CHEMBL3414764
TypeSmall organic molecule
Emp. Form.C12H12N2O4
Mol. Mass.248.2347
SMILESC\C(=C\C(=O)Nc1cccc(c1)C(N)=O)C(O)=O