Reaction Details
TargetProtein mono-ADP-ribosyltransferase PARP15
LigandBDBM50397961
Substrate/Competitorn/a
Meas. Tech.ChEMBL_1472394 (CHEMBL3420115)
IC50 17783±n/a nM
Citation Ekblad, TLindgren, AEAndersson, CDCaraballo, RThorsell, AGKarlberg, TSpjut, SLinusson, ASchüler, HElofsson, M Towards small molecule inhibitors of mono-ADP-ribosyltransferases. Eur J Med Chem95:546-51 (2015) 
 
Protein mono-ADP-ribosyltransferase PARP15
Name:Protein mono-ADP-ribosyltransferase PARP15
Type:n/a
Mol. Mass.:74595.89
Organism:Homo sapiens (Human)
Description:Q460N3
Residue:678
BDBM50397961
NameBDBM50397961
Synonyms:CHEMBL2179988
TypeSmall organic molecule
Emp. Form.C11H10N2O4
Mol. Mass.234.2081
SMILESNC(=O)c1cccc(NC(=O)\C=C\C(O)=O)c1