Reaction Details
TargetProtein mono-ADP-ribosyltransferase PARP15
LigandBDBM50079612
Substrate/Competitorn/a
Meas. Tech.ChEMBL_1472394 (CHEMBL3420115)
IC50 16218±n/a nM
Citation Ekblad, TLindgren, AEAndersson, CDCaraballo, RThorsell, AGKarlberg, TSpjut, SLinusson, ASchüler, HElofsson, M Towards small molecule inhibitors of mono-ADP-ribosyltransferases. Eur J Med Chem95:546-51 (2015) 
 
Protein mono-ADP-ribosyltransferase PARP15
Name:Protein mono-ADP-ribosyltransferase PARP15
Type:n/a
Mol. Mass.:74595.89
Organism:Homo sapiens (Human)
Description:Q460N3
Residue:678
BDBM50079612
NameBDBM50079612
Synonyms:CHEMBL3414756
TypeSmall organic molecule
Emp. Form.C11H12N2O4
Mol. Mass.236.224
SMILESNC(=O)c1cccc(NC(=O)CCC(O)=O)c1