Reaction Details
TargetProtein mono-ADP-ribosyltransferase PARP15
LigandBDBM50079626
Substrate/Competitorn/a
Meas. Tech.ChEMBL_1472394 (CHEMBL3420115)
IC50 10965±n/a nM
Citation Ekblad, TLindgren, AEAndersson, CDCaraballo, RThorsell, AGKarlberg, TSpjut, SLinusson, ASchüler, HElofsson, M Towards small molecule inhibitors of mono-ADP-ribosyltransferases. Eur J Med Chem95:546-51 (2015) 
 
Protein mono-ADP-ribosyltransferase PARP15
Name:Protein mono-ADP-ribosyltransferase PARP15
Type:n/a
Mol. Mass.:74595.89
Organism:Homo sapiens (Human)
Description:Q460N3
Residue:678
BDBM50079626
NameBDBM50079626
Synonyms:CHEMBL3414769
TypeSmall organic molecule
Emp. Form.C13H12N2O3
Mol. Mass.244.246
SMILESCC1=C(C)C(=O)N(C1=O)c1cccc(c1)C(N)=O