Reaction Details
TargetPoly [ADP-ribose] polymerase 1
LigandBDBM50397961
Substrate/Competitorn/a
Meas. Tech.ChEMBL_1472395 (CHEMBL3420116)
IC50 3631±n/a nM
Citation Ekblad, TLindgren, AEAndersson, CDCaraballo, RThorsell, AGKarlberg, TSpjut, SLinusson, ASchüler, HElofsson, M Towards small molecule inhibitors of mono-ADP-ribosyltransferases. Eur J Med Chem95:546-51 (2015) 
 
Poly [ADP-ribose] polymerase 1
Name:Poly [ADP-ribose] polymerase 1
Type:n/a
Mol. Mass.:113114.22
Organism:Homo sapiens (Human)
Description:P09874
Residue:1014
BDBM50397961
NameBDBM50397961
Synonyms:CHEMBL2179988
TypeSmall organic molecule
Emp. Form.C11H10N2O4
Mol. Mass.234.2081
SMILESNC(=O)c1cccc(NC(=O)\C=C\C(O)=O)c1