Reaction Details
TargetPoly [ADP-ribose] polymerase 1
LigandBDBM50079612
Substrate/Competitorn/a
Meas. Tech.ChEMBL_1472395 (CHEMBL3420116)
IC50 724±n/a nM
Citation Ekblad, TLindgren, AEAndersson, CDCaraballo, RThorsell, AGKarlberg, TSpjut, SLinusson, ASchüler, HElofsson, M Towards small molecule inhibitors of mono-ADP-ribosyltransferases. Eur J Med Chem95:546-51 (2015) 
 
Poly [ADP-ribose] polymerase 1
Name:Poly [ADP-ribose] polymerase 1
Type:n/a
Mol. Mass.:113114.22
Organism:Homo sapiens (Human)
Description:P09874
Residue:1014
BDBM50079612
NameBDBM50079612
Synonyms:CHEMBL3414756
TypeSmall organic molecule
Emp. Form.C11H12N2O4
Mol. Mass.236.224
SMILESNC(=O)c1cccc(NC(=O)CCC(O)=O)c1