Reaction Details
TargetProtein mono-ADP-ribosyltransferase PARP10
LigandBDBM50079614
Substrate/Competitorn/a
Meas. Tech.ChEMBL_1472392 (CHEMBL3420113)
IC50 14125±n/a nM
Citation Ekblad, TLindgren, AEAndersson, CDCaraballo, RThorsell, AGKarlberg, TSpjut, SLinusson, ASchüler, HElofsson, M Towards small molecule inhibitors of mono-ADP-ribosyltransferases. Eur J Med Chem95:546-51 (2015) 
 
Protein mono-ADP-ribosyltransferase PARP10
Name:Protein mono-ADP-ribosyltransferase PARP10
Type:n/a
Mol. Mass.:109953.63
Organism:Homo sapiens (Human)
Description:Q53GL7
Residue:1025
BDBM50079614
NameBDBM50079614
Synonyms:CHEMBL3414764
TypeSmall organic molecule
Emp. Form.C12H12N2O4
Mol. Mass.248.2347
SMILESC\C(=C\C(=O)Nc1cccc(c1)C(N)=O)C(O)=O