Reaction Details
Target3-oxoacyl-ACP synthase
LigandBDBM50079639
Substrate/Competitorn/a
Meas. Tech.ChEMBL_1472518 (CHEMBL3421140)
IC50 7000±n/a nM
Citation Sahner, JHEmpting, MKamal, AWeidel, EGroh, MBörger, CHartmann, RW Exploring the chemical space of ureidothiophene-2-carboxylic acids as inhibitors of the quorum sensing enzyme PqsD from Pseudomonas aeruginosa. Eur J Med Chem96:14-21 (2015) 
 
3-oxoacyl-ACP synthase
Name:3-oxoacyl-ACP synthase
Type:PROTEIN
Mol. Mass.:36357.84
Organism:Pseudomonas aeruginosa
Description:ChEMBL_109728
Residue:337
BDBM50079639
NameBDBM50079639
Synonyms:CHEMBL3086442
TypeSmall organic molecule
Emp. Form.C15H14N2O6S
Mol. Mass.350.346
SMILESCOc1ccc(cc1)-c1cc(NC(=O)NCC(O)=O)c(s1)C(O)=O