Reaction Details
Target3-oxoacyl-ACP synthase
LigandBDBM50079657
Substrate/Competitorn/a
Meas. Tech.ChEMBL_1472518 (CHEMBL3421140)
IC50 19400±n/a nM
Citation Sahner, JHEmpting, MKamal, AWeidel, EGroh, MBörger, CHartmann, RW Exploring the chemical space of ureidothiophene-2-carboxylic acids as inhibitors of the quorum sensing enzyme PqsD from Pseudomonas aeruginosa. Eur J Med Chem96:14-21 (2015) 
 
3-oxoacyl-ACP synthase
Name:3-oxoacyl-ACP synthase
Type:PROTEIN
Mol. Mass.:36357.84
Organism:Pseudomonas aeruginosa
Description:ChEMBL_109728
Residue:337
BDBM50079657
NameBDBM50079657
Synonyms:CHEMBL3414803
TypeSmall organic molecule
Emp. Form.C28H24N2O6S
Mol. Mass.516.565
SMILESOCc1ccc(cc1)-c1cccc(c1)-c1cc(NC(=O)N[C@@H](Cc2ccccc2)C(O)=O)c(s1)C(O)=O