Reaction Details
Target3-oxoacyl-ACP synthase
LigandBDBM50079658
Substrate/Competitorn/a
Meas. Tech.ChEMBL_1472518 (CHEMBL3421140)
IC50 6200±n/a nM
Citation Sahner, JHEmpting, MKamal, AWeidel, EGroh, MBörger, CHartmann, RW Exploring the chemical space of ureidothiophene-2-carboxylic acids as inhibitors of the quorum sensing enzyme PqsD from Pseudomonas aeruginosa. Eur J Med Chem96:14-21 (2015) 
 
3-oxoacyl-ACP synthase
Name:3-oxoacyl-ACP synthase
Type:PROTEIN
Mol. Mass.:36357.84
Organism:Pseudomonas aeruginosa
Description:ChEMBL_109728
Residue:337
BDBM50079658
NameBDBM50079658
Synonyms:CHEMBL3414802
TypeSmall organic molecule
Emp. Form.C27H22N2O5S
Mol. Mass.486.539
SMILESOC(=O)[C@H](Cc1ccccc1)NC(=O)Nc1cc(sc1C(O)=O)-c1cccc(c1)-c1ccccc1