Reaction Details
Target3-oxoacyl-ACP synthase
LigandBDBM50079772
Substrate/Competitorn/a
Meas. Tech.ChEMBL_1472518 (CHEMBL3421140)
IC50 13800±n/a nM
Citation Sahner, JHEmpting, MKamal, AWeidel, EGroh, MBörger, CHartmann, RW Exploring the chemical space of ureidothiophene-2-carboxylic acids as inhibitors of the quorum sensing enzyme PqsD from Pseudomonas aeruginosa. Eur J Med Chem96:14-21 (2015) 
 
3-oxoacyl-ACP synthase
Name:3-oxoacyl-ACP synthase
Type:PROTEIN
Mol. Mass.:36357.84
Organism:Pseudomonas aeruginosa
Description:ChEMBL_109728
Residue:337
BDBM50079772
NameBDBM50079772
Synonyms:CHEMBL3414788
TypeSmall organic molecule
Emp. Form.C21H17ClN2O6S
Mol. Mass.460.887
SMILESCOc1ccc(cc1)-c1cc(NC(=O)N[C@H](C(O)=O)c2ccc(Cl)cc2)c(s1)C(O)=O