Reaction Details
Target3-oxoacyl-ACP synthase
LigandBDBM50079795
Substrate/Competitorn/a
Meas. Tech.ChEMBL_1472518 (CHEMBL3421140)
IC50 7000±n/a nM
Citation Sahner, JHEmpting, MKamal, AWeidel, EGroh, MBörger, CHartmann, RW Exploring the chemical space of ureidothiophene-2-carboxylic acids as inhibitors of the quorum sensing enzyme PqsD from Pseudomonas aeruginosa. Eur J Med Chem96:14-21 (2015) 
 
3-oxoacyl-ACP synthase
Name:3-oxoacyl-ACP synthase
Type:PROTEIN
Mol. Mass.:36357.84
Organism:Pseudomonas aeruginosa
Description:ChEMBL_109728
Residue:337
BDBM50079795
NameBDBM50079795
Synonyms:CHEMBL3414785
TypeSmall organic molecule
Emp. Form.C14H15N2O7PS
Mol. Mass.386.317
SMILESCOc1ccc(cc1)-c1cc(NC(=O)NCP(O)(O)=O)c(s1)C(O)=O