Reaction Details
TargetHeme oxygenase 1
LigandBDBM50079977
Substrate/Competitorn/a
Meas. Tech.ChEMBL_1470660 (CHEMBL3420247)
IC50 900±n/a nM
Citation Salerno, LPittalą, VRomeo, GModica, MNMarrazzo, ASiracusa, MASorrenti, VDi Giacomo, CVanella, LParayath, NNGreish, K Novel imidazole derivatives as heme oxygenase-1 (HO-1) and heme oxygenase-2 (HO-2) inhibitors and their cytotoxic activity in human-derived cancer cell lines. Eur J Med Chem96:162-72 (2015) 
 
Heme oxygenase 1
Name:Heme oxygenase 1
Type:Enzyme
Mol. Mass.:33005.15
Organism:Rattus norvegicus (rat)
Description:HO-1 obtained from rat spleen was used in enzyme assays.
Residue:289
BDBM50079977
NameBDBM50079977
Synonyms:CHEMBL3415248
TypeSmall organic molecule
Emp. Form.C13H13N3S2
Mol. Mass.275.392
SMILESC(CSc1nc2ccccc2s1)Cn1ccnc1