Reaction Details
TargetHeme oxygenase 2
LigandBDBM50079983
Substrate/Competitorn/a
Meas. Tech.ChEMBL_1470661 (CHEMBL3420440)
IC50 900±n/a nM
Citation Salerno, LPittalą, VRomeo, GModica, MNMarrazzo, ASiracusa, MASorrenti, VDi Giacomo, CVanella, LParayath, NNGreish, K Novel imidazole derivatives as heme oxygenase-1 (HO-1) and heme oxygenase-2 (HO-2) inhibitors and their cytotoxic activity in human-derived cancer cell lines. Eur J Med Chem96:162-72 (2015) 
 
Heme oxygenase 2
Name:Heme oxygenase 2
Type:Enzyme
Mol. Mass.:35754.99
Organism:Rattus norvegicus (rat)
Description:HO-2 obtained from rat brain was used in enzyme assays.
Residue:315
BDBM50079983
NameBDBM50079983
Synonyms:CHEMBL3415244
TypeSmall organic molecule
Emp. Form.C14H17IN2O
Mol. Mass.356.2021
SMILESIc1ccc(OCCCCCn2ccnc2)cc1