Reaction Details
TargetMatrix protein 2 [1-96]
LigandBDBM50079996
Substrate/Competitorn/a
Meas. Tech.ChEMBL_1471017 (CHEMBL3420249)
IC50 17200±n/a nM
Citation Rey-Carrizo, MGazzarrini, SLlabrés, SFrigolé-Vivas, MJuárez-Jiménez, JFont-Bardia, MNaesens, LMoroni, ALuque, FJVázquez, S New polycyclic dual inhibitors of the wild type and the V27A mutant M2 channel of the influenza A virus with unexpected binding mode. Eur J Med Chem96:318-29 (2015) 
 
Matrix protein 2 [1-96]
Name:Matrix protein 2 [1-96]
Type:PROTEIN
Mol. Mass.:11051.96
Organism:Influenza A virus
Description:ChEMBL_1453980
Residue:96
BDBM50079996
NameBDBM50079996
Synonyms:CHEMBL3415948
TypeSmall organic molecule
Emp. Form.C16H21N
Mol. Mass.227.3446
SMILES[H][C@]12[C@@]3([H])[C@@]4([H])[C@@]1([H])[C@]1([H])[C@@]5([H])CNC[C@@]5([H])[C@@]4([H])[C@@]4([H])[C@]3([H])CC[C@]2([H])[C@@]14[H]