Reaction Details
TargetMatrix protein 2 [1-96]
LigandBDBM50079994
Substrate/Competitorn/a
Meas. Tech.ChEMBL_1471017 (CHEMBL3420249)
IC50 22600±n/a nM
Citation Rey-Carrizo, MGazzarrini, SLlabrés, SFrigolé-Vivas, MJuárez-Jiménez, JFont-Bardia, MNaesens, LMoroni, ALuque, FJVázquez, S New polycyclic dual inhibitors of the wild type and the V27A mutant M2 channel of the influenza A virus with unexpected binding mode. Eur J Med Chem96:318-29 (2015) 
 
Matrix protein 2 [1-96]
Name:Matrix protein 2 [1-96]
Type:PROTEIN
Mol. Mass.:11051.96
Organism:Influenza A virus
Description:ChEMBL_1453980
Residue:96
BDBM50079994
NameBDBM50079994
Synonyms:CHEMBL3305169
TypeSmall organic molecule
Emp. Form.C13H21N3
Mol. Mass.219.3259
SMILESNC(=N)N1CC2C(C1)C1CCC2C2CCC12