Reaction Details
TargetHistone deacetylase 6
LigandBDBM50080002
Substrate/Competitorn/a
Meas. Tech.ChEMBL_1471151 (CHEMBL3421282)
IC50 179±n/a nM
Citation Sodji, QHKornacki, JRMcDonald, JFMrksich, MOyelere, AK Design and structure activity relationship of tumor-homing histone deacetylase inhibitors conjugated to folic and pteroic acids. Eur J Med Chem96:340-59 (2015) 
 
Histone deacetylase 6
Name:Histone deacetylase 6
Type:Chromatin regulator; hydrolase; repressor
Mol. Mass.:131381.51
Organism:Homo sapiens (Human)
Description:Q9UBN7
Residue:1215
BDBM50080002
NameBDBM50080002
Synonyms:CHEMBL3415970
TypeSmall organic molecule
Emp. Form.C28H37N9O7
Mol. Mass.611.6495
SMILESNc1nc2ncc(CNc3ccc(cc3)C(=O)N[C@@H](CCC(=O)NCCCCCCCCC(=O)NO)C(O)=O)nc2c(=O)[nH]1