Reaction Details
TargetHistone deacetylase 1
LigandBDBM50080003
Substrate/Competitorn/a
Meas. Tech.ChEMBL_1471150 (CHEMBL3421040)
IC50 1800±n/a nM
Citation Sodji, QHKornacki, JRMcDonald, JFMrksich, MOyelere, AK Design and structure activity relationship of tumor-homing histone deacetylase inhibitors conjugated to folic and pteroic acids. Eur J Med Chem96:340-59 (2015) 
 
Histone deacetylase 1
Name:Histone deacetylase 1
Type:Enzyme
Mol. Mass.:55090.27
Organism:Homo sapiens (Human)
Description:Q13547
Residue:482
BDBM50080003
NameBDBM50080003
Synonyms:CHEMBL3415969
TypeSmall organic molecule
Emp. Form.C27H35N9O7
Mol. Mass.597.6229
SMILESNc1nc2ncc(CNc3ccc(cc3)C(=O)N[C@@H](CCC(=O)NCCCCCCCC(=O)NO)C(O)=O)nc2c(=O)[nH]1