Reaction Details
TargetCarbonic anhydrase 1
LigandBDBM50080144
Substrate/Competitorn/a
Meas. Tech.ChEMBL_1471326 (CHEMBL3418802)
Ki>10000±n/a nM
Citation Awadallah, FMEl-Waei, TAHanna, MMAbbas, SECeruso, MOz, BEGuler, OOSupuran, CT Synthesis, carbonic anhydrase inhibition and cytotoxic activity of novel chromone-based sulfonamide derivatives. Eur J Med Chem96:425-35 (2015) 
 
Carbonic anhydrase 1
Name:Carbonic anhydrase 1
Type:Enzyme
Mol. Mass.:28873.37
Organism:Homo sapiens (Human)
Description:P00915
Residue:261
BDBM50080144
NameBDBM50080144
Synonyms:CHEMBL3416240
TypeSmall organic molecule
Emp. Form.C24H16N4O5S2
Mol. Mass.504.538
SMILESO=C1N=C(Nc2ccc(cc2)S(=O)(=O)Nc2ccccn2)S\C1=C\c1coc2ccccc2c1=O