Reaction Details
TargetCarbonic anhydrase 2
LigandBDBM50080149
Substrate/Competitorn/a
Meas. Tech.ChEMBL_1471327 (CHEMBL3418803)
Ki>10000±n/a nM
Citation Awadallah, FMEl-Waei, TAHanna, MMAbbas, SECeruso, MOz, BEGuler, OOSupuran, CT Synthesis, carbonic anhydrase inhibition and cytotoxic activity of novel chromone-based sulfonamide derivatives. Eur J Med Chem96:425-35 (2015) 
 
Carbonic anhydrase 2
Name:Carbonic anhydrase 2
Type:Enzyme
Mol. Mass.:29250.71
Organism:Homo sapiens (Human)
Description:P00918
Residue:260
BDBM50080149
NameBDBM50080149
Synonyms:CHEMBL3416228
TypeSmall organic molecule
Emp. Form.C24H24N4O5S
Mol. Mass.480.536
SMILESCCOC1Oc2ccccc2C(=O)\C1=C\Nc1ccc(cc1)S(=O)(=O)Nc1nc(C)cc(C)n1