Reaction Details
TargetCarbonic anhydrase 9
LigandBDBM50080144
Substrate/Competitorn/a
Meas. Tech.ChEMBL_1471328 (CHEMBL3418804)
Ki 26±n/a nM
Citation Awadallah, FMEl-Waei, TAHanna, MMAbbas, SECeruso, MOz, BEGuler, OOSupuran, CT Synthesis, carbonic anhydrase inhibition and cytotoxic activity of novel chromone-based sulfonamide derivatives. Eur J Med Chem96:425-35 (2015) 
 
Carbonic anhydrase 9
Name:Carbonic anhydrase 9
Type:Enzyme
Mol. Mass.:49669.03
Organism:Homo sapiens (Human)
Description:Catalytic domain of human cloned isozyme was used in the assay
Residue:459
BDBM50080144
NameBDBM50080144
Synonyms:CHEMBL3416240
TypeSmall organic molecule
Emp. Form.C24H16N4O5S2
Mol. Mass.504.538
SMILESO=C1N=C(Nc2ccc(cc2)S(=O)(=O)Nc2ccccn2)S\C1=C\c1coc2ccccc2c1=O