Reaction Details
TargetCarbonic anhydrase 12
LigandBDBM50080149
Substrate/Competitorn/a
Meas. Tech.ChEMBL_1471329 (CHEMBL3418805)
Ki 79±n/a nM
Citation Awadallah, FMEl-Waei, TAHanna, MMAbbas, SECeruso, MOz, BEGuler, OOSupuran, CT Synthesis, carbonic anhydrase inhibition and cytotoxic activity of novel chromone-based sulfonamide derivatives. Eur J Med Chem96:425-35 (2015) 
 
Carbonic anhydrase 12
Name:Carbonic anhydrase 12
Type:Enzyme
Mol. Mass.:39456.00
Organism:Homo sapiens (Human)
Description:Catalytic domain of human cloned isozyme was used in the assay
Residue:354
BDBM50080149
NameBDBM50080149
Synonyms:CHEMBL3416228
TypeSmall organic molecule
Emp. Form.C24H24N4O5S
Mol. Mass.480.536
SMILESCCOC1Oc2ccccc2C(=O)\C1=C\Nc1ccc(cc1)S(=O)(=O)Nc1nc(C)cc(C)n1