Reaction Details
TargetCarbonic anhydrase 12
LigandBDBM50080152
Substrate/Competitorn/a
Meas. Tech.ChEMBL_1471329 (CHEMBL3418805)
Ki 11±n/a nM
Citation Awadallah, FMEl-Waei, TAHanna, MMAbbas, SECeruso, MOz, BEGuler, OOSupuran, CT Synthesis, carbonic anhydrase inhibition and cytotoxic activity of novel chromone-based sulfonamide derivatives. Eur J Med Chem96:425-35 (2015) 
 
Carbonic anhydrase 12
Name:Carbonic anhydrase 12
Type:Enzyme
Mol. Mass.:39456.00
Organism:Homo sapiens (Human)
Description:Catalytic domain of human cloned isozyme was used in the assay
Residue:354
BDBM50080152
NameBDBM50080152
Synonyms:CHEMBL3416230
TypeSmall organic molecule
Emp. Form.C20H17N3O5S
Mol. Mass.411.431
SMILESCc1cc(NS(=O)(=O)c2ccc(NCc3coc4ccccc4c3=O)cc2)no1