Reaction Details
TargetPotassium voltage-gated channel subfamily H member 2
LigandBDBM22874
Substrate/Competitorn/a
Meas. Tech.ChEMBL_1474742 (CHEMBL3424160)
Ki 23000±n/a nM
Citation Rankovic, Z CNS drug design: balancing physicochemical properties for optimal brain exposure. J Med Chem58:2584-608 (2015) 
 
Potassium voltage-gated channel subfamily H member 2
Name:Potassium voltage-gated channel subfamily H member 2
Type:Multi-pass membrane protein
Mol. Mass.:126672.65
Organism:Homo sapiens (Human)
Description:Q12809
Residue:1159
BDBM22874
NameBDBM22874
Synonyms:2-(4-{1-hydroxy-4-[4-(hydroxydiphenylmethyl)piperidin-1-yl]butyl}phenyl)-2-methylpropanoic acid Allegra Fexofenadine | MDL-16455
TypeSmall organic molecule
Emp. Form.C32H39NO4
Mol. Mass.501.6564
SMILESCC(C)(C(O)=O)c1ccc(cc1)C(O)CCCN1CCC(CC1)C(O)(c1ccccc1)c1ccccc1