Reaction Details
TargetEpithelial discoidin domain-containing receptor 1
LigandBDBM104010
Substrate/Competitorn/a
Meas. Tech.ChEMBL_1474754 (CHEMBL3424172)
IC50 47±n/a nM
Citation Li, YLu, XRen, XDing, K Small molecule discoidin domain receptor kinase inhibitors and potential medical applications. J Med Chem58:3287-301 (2015) 
 
Epithelial discoidin domain-containing receptor 1
Name:Epithelial discoidin domain-containing receptor 1
Type:Tyrosine-protein kinase
Mol. Mass.:101130.02
Organism:Homo sapiens (Human)
Description:Q08345
Residue:913
BDBM104010
NameBDBM104010
Synonyms:DDR1-IN-2
TypeSmall organic molecule
Emp. Form.C31H35F3N6O2
Mol. Mass.580.6438
SMILESCCN1CCN(Cc2ccc(cc2C(F)(F)F)C(=O)Nc2ccc(C)c(NCc3cnc4[nH]ccc4c3OC)c2)CC1