Reaction Details
TargetCellular tumor antigen p53
LigandBDBM50080457
Substrate/Competitorn/a
Meas. Tech.ChEMBL_1474783 (CHEMBL3424240)
IC50 6200±n/a nM
Citation Tatsuda, DMomose, ISomeno, TSawa, RKubota, YIijima, MKunisada, TWatanabe, TShibasaki, MNomoto, A Quinofuracins A-E, produced by the fungus Staphylotrichum boninense PF1444, show p53-dependent growth suppression. J Nat Prod78:188-95 (2015) 
 
Cellular tumor antigen p53
Name:Cellular tumor antigen p53
Type:fusion protein
Mol. Mass.:43654.73
Organism:Homo sapiens (Human)
Description:The full-length His6-wt-p53 expressed in E. coli was used in assays.
Residue:393
BDBM50080457
NameBDBM50080457
Synonyms:CHEMBL3422268
TypeSmall organic molecule
Emp. Form.C28H32O13
Mol. Mass.576.5459
SMILES[H][C@@]1(O[C@@H](CCCCC)c2c(O)cc3C(=O)c4cc(O)cc(O)c4C(=O)c3c2O)O[C@@]([H])([C@H](O)CO)[C@H](O)[C@H]1OC(C)=O