Reaction Details
TargetSphingosine 1-phosphate receptor 1
LigandBDBM50080575
Substrate/Competitorn/a
Meas. Tech.ChEMBL_1475218 (CHEMBL3424973)
EC50 0.700000±n/a nM
Citation Rosse, G Novel Pyridyloxadiazole Agonists of Sphingosin-1-phosphate. ACS Med Chem Lett6:102-3 (2015) 
 
Sphingosine 1-phosphate receptor 1
Name:Sphingosine 1-phosphate receptor 1
Type:Enzyme
Mol. Mass.:42836.02
Organism:Homo sapiens (Human)
Description:P21453
Residue:382
BDBM50080575
NameBDBM50080575
Synonyms:CHEMBL3126602 | US9617250, Example 2
TypeSmall organic molecule
Emp. Form.C24H30N4O5
Mol. Mass.454.5188
SMILESCCCc1cc(ccn1)-c1nc(no1)-c1cc(C)c(OC[C@@H](O)CNC(=O)CO)c(CC)c1