Reaction Details
TargetSphingosine 1-phosphate receptor 3
LigandBDBM50080573
Substrate/Competitorn/a
Meas. Tech.ChEMBL_1475219 (CHEMBL3424974)
EC50 700±n/a nM
Citation Rosse, G Novel Pyridyloxadiazole Agonists of Sphingosin-1-phosphate. ACS Med Chem Lett6:102-3 (2015) 
 
Sphingosine 1-phosphate receptor 3
Name:Sphingosine 1-phosphate receptor 3
Type:G Protein-Coupled Receptor (GPCR)
Mol. Mass.:42278.13
Organism:Homo sapiens (Human)
Description:Q99500
Residue:378
BDBM50080573
NameBDBM50080573
Synonyms:CHEMBL3126604 | US9617250, Example 4
TypeSmall organic molecule
Emp. Form.C25H32N4O5
Mol. Mass.468.5454
SMILESCCCCc1cc(ccn1)-c1nc(no1)-c1cc(C)c(OC[C@@H](O)CNC(=O)CO)c(CC)c1