Reaction Details
TargetMelanocortin receptor 4
LigandBDBM50027084
Substrate/Competitorn/a
Meas. Tech.ChEMBL_1475227 (CHEMBL3425025)
EC50 0.050000±n/a nM
Citation Doering, SRTodorovic, AHaskell-Luevano, C Melanocortin antagonist tetrapeptides with minimal agonist activity at the mouse melanocortin-3 receptor. ACS Med Chem Lett6:123-7 (2015) 
 
Melanocortin receptor 4
Name:Melanocortin receptor 4
Type:PROTEIN
Mol. Mass.:36964.43
Organism:Mus musculus
Description:ChEMBL_1498850
Residue:332
BDBM50027084
NameBDBM50027084
Synonyms:Melatonan
TypeSmall organic molecule
Emp. Form.C50H69N15O9
Mol. Mass.1024.178
SMILESCCCC[C@H](NC(C)=O)C(=O)N[C@H]1CC(=O)NCCCC[C@H](NC(=O)[C@H](Cc2c[nH]c3ccccc23)NC(=O)[C@H](CCCNC(N)=N)NC(=O)[C@@H](Cc2ccccc2)NC(=O)[C@H](Cc2cnc[nH]2)NC1=O)C(N)=O