Reaction Details
TargetMelanocyte-stimulating hormone receptor
LigandBDBM50080877
Substrate/Competitorn/a
Meas. Tech.ChEMBL_1475327 (CHEMBL3425224)
EC50 1000±n/a nM
Citation Van der Poorten, OFehér, KBuysse, KFeytens, DZoi, ISchwartz, SDMartins, JCTourwé, DCai, MHruby, VJBallet, S Azepinone-Containing Tetrapeptide Analogues of Melanotropin Lead to Selective hMC4R Agonists and hMC5R Antagonist. ACS Med Chem Lett6:192-7 (2015) 
 
Melanocyte-stimulating hormone receptor
Name:Melanocyte-stimulating hormone receptor
Type:Enzyme
Mol. Mass.:34717.23
Organism:Homo sapiens (Human)
Description:Q01726
Residue:317
BDBM50080877
NameBDBM50080877
Synonyms:CHEMBL3421679
TypeSmall organic molecule
Emp. Form.C38H45N9O5
Mol. Mass.707.8212
SMILESCC(=O)N[C@H]1Cc2ccccc2CN([C@H](Cc2ccccc2)C(=O)N[C@@H](CCCNC(N)=N)C(=O)N[C@@H](Cc2c[nH]c3ccccc23)C(N)=O)C1=O