Reaction Details
TargetMelanocortin receptor 3
LigandBDBM50080876
Substrate/Competitorn/a
Meas. Tech.ChEMBL_1475329 (CHEMBL3425226)
IC50 100±n/a nM
Citation Van der Poorten, OFehér, KBuysse, KFeytens, DZoi, ISchwartz, SDMartins, JCTourwé, DCai, MHruby, VJBallet, S Azepinone-Containing Tetrapeptide Analogues of Melanotropin Lead to Selective hMC4R Agonists and hMC5R Antagonist. ACS Med Chem Lett6:192-7 (2015) 
 
Melanocortin receptor 3
Name:Melanocortin receptor 3
Type:Enzyme
Mol. Mass.:36044.86
Organism:Homo sapiens (Human)
Description:P41968
Residue:323
BDBM50080876
NameBDBM50080876
Synonyms:CHEMBL3421678
TypeSmall organic molecule
Emp. Form.C40H45BrN10O5
Mol. Mass.825.753
SMILESCC(=O)N[C@H]1Cc2c(CN([C@H](Cc3ccc(Br)cc3)C(=O)N[C@@H](CCCNC(N)=N)C(=O)N[C@@H](Cc3c[nH]c4ccccc34)C(N)=O)C1=O)[nH]c1ccccc21