Reaction Details
TargetCannabinoid receptor 1
LigandBDBM50081015
Substrate/Competitorn/a
Meas. Tech.ChEMBL_1475403 (CHEMBL3425367)
Ki>3000±n/a nM
Citation El Bakali, JMuccioli, GGBody-Malapel, MDjouina, MKlupsch, FGhinet, ABarczyk, ARenault, NChavatte, PDesreumaux, PLambert, DMMillet, R Conformational Restriction Leading to a Selective CB2 Cannabinoid Receptor Agonist Orally Active Against Colitis. ACS Med Chem Lett6:198-203 (2015) 
 
Cannabinoid receptor 1
Name:Cannabinoid receptor 1
Type:G Protein-Coupled Receptor (GPCR)
Mol. Mass.:52868.96
Organism:Homo sapiens (Human)
Description:P21554
Residue:472
BDBM50081015
NameBDBM50081015
Synonyms:CHEMBL3421696
TypeSmall organic molecule
Emp. Form.C19H23N3O
Mol. Mass.309.4054
SMILESCCCCCn1cc2c(nn(CC3CC3)c2=O)c2ccccc12