Reaction Details
TargetCannabinoid receptor 1
LigandBDBM50081000
Substrate/Competitorn/a
Meas. Tech.ChEMBL_1475403 (CHEMBL3425367)
Ki>3000±n/a nM
Citation El Bakali, JMuccioli, GGBody-Malapel, MDjouina, MKlupsch, FGhinet, ABarczyk, ARenault, NChavatte, PDesreumaux, PLambert, DMMillet, R Conformational Restriction Leading to a Selective CB2 Cannabinoid Receptor Agonist Orally Active Against Colitis. ACS Med Chem Lett6:198-203 (2015) 
 
Cannabinoid receptor 1
Name:Cannabinoid receptor 1
Type:G Protein-Coupled Receptor (GPCR)
Mol. Mass.:52868.96
Organism:Homo sapiens (Human)
Description:P21554
Residue:472
BDBM50081000
NameBDBM50081000
Synonyms:CHEMBL3421682
TypeSmall organic molecule
Emp. Form.C21H21N3O
Mol. Mass.331.4109
SMILESCCCCCn1c(-c2ccccc2)c2c(n[nH]c2=O)c2ccccc12