Reaction Details
TargetGlucocorticoid receptor
LigandBDBM50081073
Substrate/Competitorn/a
Meas. Tech.ChEMBL_1475545 (CHEMBL3424571)
IC50 0.300000±n/a nM
Citation Chantigny, YAMurray, JCKleinman, EFRobinson, RPPlotkin, MAReese, MRBuckbinder, LMcNiff, PAMillham, MLSchaefer, JFAbramov, YABordner, J 2-Aryl-3-methyloctahydrophenanthrene-2,3,7-triols as potent dissociated glucocorticoid receptor agonists. J Med Chem58:2658-77 (2015) 
 
Glucocorticoid receptor
Name:Glucocorticoid receptor
Type:Enzyme
Mol. Mass.:85656.87
Organism:Homo sapiens (Human)
Description:P04150
Residue:777
BDBM50081073
NameBDBM50081073
Synonyms:CHEMBL3421889
TypeSmall organic molecule
Emp. Form.C23H26O3
Mol. Mass.350.4507
SMILES[H][C@@]12C[C@@](O)(c3ccccc3)[C@](C)(O)C[C@@]1(CC)c1ccc(O)cc1C=C2