Reaction Details
TargetProgesterone receptor
LigandBDBM50081070
Substrate/Competitorn/a
Meas. Tech.ChEMBL_1475555 (CHEMBL3424581)
IC50 0.200000±n/a nM
Citation Chantigny, YAMurray, JCKleinman, EFRobinson, RPPlotkin, MAReese, MRBuckbinder, LMcNiff, PAMillham, MLSchaefer, JFAbramov, YABordner, J 2-Aryl-3-methyloctahydrophenanthrene-2,3,7-triols as potent dissociated glucocorticoid receptor agonists. J Med Chem58:2658-77 (2015) 
 
Progesterone receptor
Name:Progesterone receptor
Type:Protein
Mol. Mass.:98979.52
Organism:Homo sapiens (Human)
Description:P06401
Residue:933
BDBM50081070
NameBDBM50081070
Synonyms:CHEMBL3421892
TypeSmall organic molecule
Emp. Form.C23H19ClF4N2O4
Mol. Mass.498.855
SMILESCc1noc(=O)c2ccc(NC(=O)C(O)(CC3(CCC3)c3cc(F)ccc3Cl)C(F)(F)F)cc12