Reaction Details
TargetDual specificity tyrosine-phosphorylation-regulated kinase 1B
LigandBDBM50081184
Substrate/Competitorn/a
Meas. Tech.ChEMBL_1475745 (CHEMBL3424978)
IC50 16±n/a nM
Citation Kettle, JGBallard, PBardelle, CCockerill, MColclough, NCritchlow, SEDebreczeni, JFairley, GFillery, SGraham, MAGoodwin, LGuichard, SHudson, KWard, RAWhittaker, D Discovery and optimization of a novel series of Dyrk1B kinase inhibitors to explore a MEK resistance hypothesis. J Med Chem58:2834-44 (2015) 
 
Dual specificity tyrosine-phosphorylation-regulated kinase 1B
Name:Dual specificity tyrosine-phosphorylation-regulated kinase 1B
Type:Enzyme
Mol. Mass.:69222.24
Organism:Homo sapiens (Human)
Description:Q9Y463
Residue:629
BDBM50081184
NameBDBM50081184
Synonyms:CHEMBL3421964
TypeSmall organic molecule
Emp. Form.C24H25N7O2
Mol. Mass.443.501
SMILESCOc1cc(ccc1Nc1cc(ncn1)-c1c[nH]c2cnccc12)N1CCN(CC1)C(C)=O