Reaction Details
TargetDual specificity tyrosine-phosphorylation-regulated kinase 1B
LigandBDBM50081188
Substrate/Competitorn/a
Meas. Tech.ChEMBL_1475745 (CHEMBL3424978)
IC50 3.0±n/a nM
Citation Kettle, JGBallard, PBardelle, CCockerill, MColclough, NCritchlow, SEDebreczeni, JFairley, GFillery, SGraham, MAGoodwin, LGuichard, SHudson, KWard, RAWhittaker, D Discovery and optimization of a novel series of Dyrk1B kinase inhibitors to explore a MEK resistance hypothesis. J Med Chem58:2834-44 (2015) 
 
Dual specificity tyrosine-phosphorylation-regulated kinase 1B
Name:Dual specificity tyrosine-phosphorylation-regulated kinase 1B
Type:Enzyme
Mol. Mass.:69222.24
Organism:Homo sapiens (Human)
Description:Q9Y463
Residue:629
BDBM50081188
NameBDBM50081188
Synonyms:CHEMBL3421981
TypeSmall organic molecule
Emp. Form.C14H10N4
Mol. Mass.234.256
SMILESc1cc2c(ccnc2[nH]1)-c1c[nH]c2cnccc12