Reaction Details
TargetDual specificity tyrosine-phosphorylation-regulated kinase 1B
LigandBDBM50081193
Substrate/Competitorn/a
Meas. Tech.ChEMBL_1475745 (CHEMBL3424978)
IC50 12±n/a nM
Citation Kettle, JGBallard, PBardelle, CCockerill, MColclough, NCritchlow, SEDebreczeni, JFairley, GFillery, SGraham, MAGoodwin, LGuichard, SHudson, KWard, RAWhittaker, D Discovery and optimization of a novel series of Dyrk1B kinase inhibitors to explore a MEK resistance hypothesis. J Med Chem58:2834-44 (2015) 
 
Dual specificity tyrosine-phosphorylation-regulated kinase 1B
Name:Dual specificity tyrosine-phosphorylation-regulated kinase 1B
Type:Enzyme
Mol. Mass.:69222.24
Organism:Homo sapiens (Human)
Description:Q9Y463
Residue:629
BDBM50081193
NameBDBM50081193
Synonyms:CHEMBL3421976
TypeSmall organic molecule
Emp. Form.C19H16N4O2S
Mol. Mass.364.421
SMILESCn1cc(-c2ccnc(n2)-c2ccc(cc2)S(C)(=O)=O)c2ccncc12