Reaction Details
TargetCytochrome P450 2D6
LigandBDBM50081468
Substrate/Competitorn/a
Meas. Tech.ChEMBL_1474034 (CHEMBL3423892)
Ki 423±n/a nM
Citation Lv, WLiu, JSkaar, TCFlockhart, DACushman, M Design and synthesis of norendoxifen analogues with dual aromatase inhibitory and estrogen receptor modulatory activities. J Med Chem58:2623-48 (2015) 
 
Cytochrome P450 2D6
Name:Cytochrome P450 2D6
Type:Protein
Mol. Mass.:55774.82
Organism:Homo sapiens (Human)
Description:P10635
Residue:497
BDBM50081468
NameBDBM50081468
Synonyms:CHEMBL3422028
TypeSmall organic molecule
Emp. Form.C24H25NO3
Mol. Mass.375.4602
SMILESCC\C(=C(\c1ccc(O)cc1)c1ccc(OCCN)cc1)c1ccc(O)cc1