Reaction Details
TargetAurora kinase A
LigandBDBM50081554
Substrate/Competitorn/a
Meas. Tech.ChEMBL_1474042 (CHEMBL3423900)
IC50 2300±n/a nM
Citation Liu, YLang, YPatel, NKNg, GLaufer, RLi, SWEdwards, LForrest, BSampson, PBFeher, MBan, FAwrey, DEBeletskaya, IMao, GHodgson, RPlotnikova, OQiu, WChirgadze, NYMason, JMWei, XLin, DCChe, YKiarash, RMadeira, BFletcher, GCMak, TWBray, MRPauls, HW The Discovery of Orally Bioavailable Tyrosine Threonine Kinase (TTK) Inhibitors: 3-(4-(heterocyclyl)phenyl)-1H-indazole-5-carboxamides as Anticancer Agents. J Med Chem58:3366-92 (2015) 
 
Aurora kinase A
Name:Aurora kinase A
Type:Serine/threonine-protein kinase
Mol. Mass.:45830.98
Organism:Homo sapiens (Human)
Description:O14965
Residue:403
BDBM50081554
NameBDBM50081554
Synonyms:CHEMBL3422067
TypeSmall organic molecule
Emp. Form.C29H37N5O3
Mol. Mass.503.6358
SMILESO=C(NCC1(CCCCC1)N1CCOCC1)c1ccc2[nH]nc(-c3ccc(cc3)N3CCOCC3)c2c1