Reaction Details
TargetAurora kinase A
LigandBDBM50081555
Substrate/Competitorn/a
Meas. Tech.ChEMBL_1474042 (CHEMBL3423900)
IC50 2300±n/a nM
Citation Liu, YLang, YPatel, NKNg, GLaufer, RLi, SWEdwards, LForrest, BSampson, PBFeher, MBan, FAwrey, DEBeletskaya, IMao, GHodgson, RPlotnikova, OQiu, WChirgadze, NYMason, JMWei, XLin, DCChe, YKiarash, RMadeira, BFletcher, GCMak, TWBray, MRPauls, HW The Discovery of Orally Bioavailable Tyrosine Threonine Kinase (TTK) Inhibitors: 3-(4-(heterocyclyl)phenyl)-1H-indazole-5-carboxamides as Anticancer Agents. J Med Chem58:3366-92 (2015) 
 
Aurora kinase A
Name:Aurora kinase A
Type:Serine/threonine-protein kinase
Mol. Mass.:45830.98
Organism:Homo sapiens (Human)
Description:O14965
Residue:403
BDBM50081555
NameBDBM50081555
Synonyms:CHEMBL3422068
TypeSmall organic molecule
Emp. Form.C30H34N4O2S
Mol. Mass.514.682
SMILESCN1CCC(CC1)Oc1ccc(cc1)-c1n[nH]c2ccc(NC(=O)C(C3CCCC3)c3ccsc3)cc12