Reaction Details
TargetCytochrome P450 3A4
LigandBDBM50081564
Substrate/Competitorn/a
Meas. Tech.ChEMBL_1474044 (CHEMBL3423902)
IC50 1000±n/a nM
Citation Liu, YLang, YPatel, NKNg, GLaufer, RLi, SWEdwards, LForrest, BSampson, PBFeher, MBan, FAwrey, DEBeletskaya, IMao, GHodgson, RPlotnikova, OQiu, WChirgadze, NYMason, JMWei, XLin, DCChe, YKiarash, RMadeira, BFletcher, GCMak, TWBray, MRPauls, HW The Discovery of Orally Bioavailable Tyrosine Threonine Kinase (TTK) Inhibitors: 3-(4-(heterocyclyl)phenyl)-1H-indazole-5-carboxamides as Anticancer Agents. J Med Chem58:3366-92 (2015) 
 
Cytochrome P450 3A4
Name:Cytochrome P450 3A4
Type:Enzyme
Mol. Mass.:57349.57
Organism:Homo sapiens (Human)
Description:n/a
Residue:503
BDBM50081564
NameBDBM50081564
Synonyms:CHEMBL3422074
TypeSmall organic molecule
Emp. Form.C33H37N5O3
Mol. Mass.551.6786
SMILESCN(C)CC(=O)N1CCC(CC1)Oc1ccc(cc1)-c1n[nH]c2ccc(cc12)C(=O)NC(C1CC1)c1ccccc1