Reaction Details
TargetCytochrome P450 3A4
LigandBDBM50081573
Substrate/Competitorn/a
Meas. Tech.ChEMBL_1474044 (CHEMBL3423902)
IC50 1400±n/a nM
Citation Liu, YLang, YPatel, NKNg, GLaufer, RLi, SWEdwards, LForrest, BSampson, PBFeher, MBan, FAwrey, DEBeletskaya, IMao, GHodgson, RPlotnikova, OQiu, WChirgadze, NYMason, JMWei, XLin, DCChe, YKiarash, RMadeira, BFletcher, GCMak, TWBray, MRPauls, HW The Discovery of Orally Bioavailable Tyrosine Threonine Kinase (TTK) Inhibitors: 3-(4-(heterocyclyl)phenyl)-1H-indazole-5-carboxamides as Anticancer Agents. J Med Chem58:3366-92 (2015) 
 
Cytochrome P450 3A4
Name:Cytochrome P450 3A4
Type:Enzyme
Mol. Mass.:57349.57
Organism:Homo sapiens (Human)
Description:n/a
Residue:503
BDBM50081573
NameBDBM50081573
Synonyms:CHEMBL3422085
TypeSmall organic molecule
Emp. Form.C29H29N5O2
Mol. Mass.479.5729
SMILESO=C(N[C@H](C1CC1)c1ccccn1)c1ccc2[nH]nc(-c3ccc(cc3)N3C4CCC3COC4)c2c1