Reaction Details
TargetCytochrome P450 3A4
LigandBDBM50081596
Substrate/Competitorn/a
Meas. Tech.ChEMBL_1474044 (CHEMBL3423902)
IC50 230±n/a nM
Citation Liu, YLang, YPatel, NKNg, GLaufer, RLi, SWEdwards, LForrest, BSampson, PBFeher, MBan, FAwrey, DEBeletskaya, IMao, GHodgson, RPlotnikova, OQiu, WChirgadze, NYMason, JMWei, XLin, DCChe, YKiarash, RMadeira, BFletcher, GCMak, TWBray, MRPauls, HW The Discovery of Orally Bioavailable Tyrosine Threonine Kinase (TTK) Inhibitors: 3-(4-(heterocyclyl)phenyl)-1H-indazole-5-carboxamides as Anticancer Agents. J Med Chem58:3366-92 (2015) 
 
Cytochrome P450 3A4
Name:Cytochrome P450 3A4
Type:Enzyme
Mol. Mass.:57349.57
Organism:Homo sapiens (Human)
Description:n/a
Residue:503
BDBM50081596
NameBDBM50081596
Synonyms:CHEMBL3422094
TypeSmall organic molecule
Emp. Form.C32H35N5O2
Mol. Mass.521.6526
SMILES[H][C@]12CC[C@@]([H])(CC(O)C1)N2c1ccc(cc1)-c1n[nH]c2ccc(cc12)C(=O)N[C@H](C1CCCC1)c1ccccn1