Reaction Details
TargetDual specificity protein kinase TTK
LigandBDBM50081571
Substrate/Competitorn/a
Meas. Tech.ChEMBL_1474037 (CHEMBL3423895)
IC50 2.0±n/a nM
Citation Liu, YLang, YPatel, NKNg, GLaufer, RLi, SWEdwards, LForrest, BSampson, PBFeher, MBan, FAwrey, DEBeletskaya, IMao, GHodgson, RPlotnikova, OQiu, WChirgadze, NYMason, JMWei, XLin, DCChe, YKiarash, RMadeira, BFletcher, GCMak, TWBray, MRPauls, HW The Discovery of Orally Bioavailable Tyrosine Threonine Kinase (TTK) Inhibitors: 3-(4-(heterocyclyl)phenyl)-1H-indazole-5-carboxamides as Anticancer Agents. J Med Chem58:3366-92 (2015) 
 
Dual specificity protein kinase TTK
Name:Dual specificity protein kinase TTK
Type:Protein
Mol. Mass.:97086.79
Organism:Homo sapiens (Human)
Description:P33981
Residue:857
BDBM50081571
NameBDBM50081571
Synonyms:CHEMBL3422083
TypeSmall organic molecule
Emp. Form.C30H31ClN4O2
Mol. Mass.515.046
SMILESCC(C)[C@H](NC(=O)c1ccc2[nH]nc(-c3ccc(cc3)N3C4CCC3COC4)c2c1)c1ccccc1Cl