Reaction Details
TargetDual specificity protein kinase TTK
LigandBDBM50081599
Substrate/Competitorn/a
Meas. Tech.ChEMBL_1474037 (CHEMBL3423895)
IC50 2.7±n/a nM
Citation Liu, YLang, YPatel, NKNg, GLaufer, RLi, SWEdwards, LForrest, BSampson, PBFeher, MBan, FAwrey, DEBeletskaya, IMao, GHodgson, RPlotnikova, OQiu, WChirgadze, NYMason, JMWei, XLin, DCChe, YKiarash, RMadeira, BFletcher, GCMak, TWBray, MRPauls, HW The Discovery of Orally Bioavailable Tyrosine Threonine Kinase (TTK) Inhibitors: 3-(4-(heterocyclyl)phenyl)-1H-indazole-5-carboxamides as Anticancer Agents. J Med Chem58:3366-92 (2015) 
 
Dual specificity protein kinase TTK
Name:Dual specificity protein kinase TTK
Type:Protein
Mol. Mass.:97086.79
Organism:Homo sapiens (Human)
Description:P33981
Residue:857
BDBM50081599
NameBDBM50081599
Synonyms:CHEMBL3422098
TypeSmall organic molecule
Emp. Form.C31H35N5O2
Mol. Mass.509.6419
SMILES[H][C@]12CC[C@@]([H])(CC(O)C1)N2c1ccc(cc1)-c1n[nH]c2ccc(cc12)C(=O)N[C@H](CC(C)C)c1ccccn1