Reaction Details
TargetPotassium voltage-gated channel subfamily H member 2
LigandBDBM50081642
Substrate/Competitorn/a
Meas. Tech.ChEMBL_1474497 (CHEMBL3423786)
IC50 19600±n/a nM
Citation Brodney, MABeck, EMButler, CRBarreiro, GJohnson, EFRiddell, DParris, KNolan, CEFan, YAtchison, KGonzales, CRobshaw, AEDoran, SDBundesmann, MWBuzon, LDutra, JHenegar, KLaChapelle, EHou, XRogers, BNPandit, JLira, RMartinez-Alsina, LMikochik, PMurray, JCOgilvie, KPrice, LSakya, SMYu, AZhang, YO'Neill, BT Utilizing structures of CYP2D6 and BACE1 complexes to reduce risk of drug-drug interactions with a novel series of centrally efficacious BACE1 inhibitors. J Med Chem58:3223-52 (2015) 
 
Potassium voltage-gated channel subfamily H member 2
Name:Potassium voltage-gated channel subfamily H member 2
Type:Multi-pass membrane protein
Mol. Mass.:126672.65
Organism:Homo sapiens (Human)
Description:Q12809
Residue:1159
BDBM50081642
NameBDBM50081642
Synonyms:CHEMBL3422244
TypeSmall organic molecule
Emp. Form.C18H18F3N3O2S
Mol. Mass.397.415
SMILES[H][C@@]12C[C@@H](OC[C@@]1(N=C(N)S[C@@H]2CF)c1ccc(F)cc1F)c1nc(C)co1