Reaction Details
TargetCathepsin D
LigandBDBM50081645
Substrate/Competitorn/a
Meas. Tech.ChEMBL_1474436 (CHEMBL3423725)
IC50 9400±n/a nM
Citation Brodney, MABeck, EMButler, CRBarreiro, GJohnson, EFRiddell, DParris, KNolan, CEFan, YAtchison, KGonzales, CRobshaw, AEDoran, SDBundesmann, MWBuzon, LDutra, JHenegar, KLaChapelle, EHou, XRogers, BNPandit, JLira, RMartinez-Alsina, LMikochik, PMurray, JCOgilvie, KPrice, LSakya, SMYu, AZhang, YO'Neill, BT Utilizing structures of CYP2D6 and BACE1 complexes to reduce risk of drug-drug interactions with a novel series of centrally efficacious BACE1 inhibitors. J Med Chem58:3223-52 (2015) 
 
Cathepsin D
Name:Cathepsin D
Type:Enzyme
Mol. Mass.:44551.72
Organism:Homo sapiens (Human)
Description:Human proCathepsin D (SwissProt accession number P07339) was expressed in Sf9 cells, purified, and autoactivated.
Residue:412
BDBM50081645
NameBDBM50081645
Synonyms:CHEMBL3422237
TypeSmall organic molecule
Emp. Form.C17H17F2N3O2S
Mol. Mass.365.398
SMILES[H][C@]12CSC(N)=N[C@]1(CO[C@H](C2)c1cc(C)no1)c1ccc(F)cc1F