Reaction Details
TargetCytochrome P450 2C8
LigandBDBM50081642
Substrate/Competitorn/a
Meas. Tech.ChEMBL_1474440 (CHEMBL3423729)
IC50>30000±n/a nM
Citation Brodney, MABeck, EMButler, CRBarreiro, GJohnson, EFRiddell, DParris, KNolan, CEFan, YAtchison, KGonzales, CRobshaw, AEDoran, SDBundesmann, MWBuzon, LDutra, JHenegar, KLaChapelle, EHou, XRogers, BNPandit, JLira, RMartinez-Alsina, LMikochik, PMurray, JCOgilvie, KPrice, LSakya, SMYu, AZhang, YO'Neill, BT Utilizing structures of CYP2D6 and BACE1 complexes to reduce risk of drug-drug interactions with a novel series of centrally efficacious BACE1 inhibitors. J Med Chem58:3223-52 (2015) 
 
Cytochrome P450 2C8
Name:Cytochrome P450 2C8
Type:Protein
Mol. Mass.:55839.23
Organism:Homo sapiens (Human)
Description:P10632
Residue:490
BDBM50081642
NameBDBM50081642
Synonyms:CHEMBL3422244
TypeSmall organic molecule
Emp. Form.C18H18F3N3O2S
Mol. Mass.397.415
SMILES[H][C@@]12C[C@@H](OC[C@@]1(N=C(N)S[C@@H]2CF)c1ccc(F)cc1F)c1nc(C)co1