Reaction Details
TargetBeta-secretase 1
LigandBDBM50081646
Substrate/Competitorn/a
Meas. Tech.ChEMBL_1474435 (CHEMBL3423724)
IC50 4.0±n/a nM
Citation Brodney, MABeck, EMButler, CRBarreiro, GJohnson, EFRiddell, DParris, KNolan, CEFan, YAtchison, KGonzales, CRobshaw, AEDoran, SDBundesmann, MWBuzon, LDutra, JHenegar, KLaChapelle, EHou, XRogers, BNPandit, JLira, RMartinez-Alsina, LMikochik, PMurray, JCOgilvie, KPrice, LSakya, SMYu, AZhang, YO'Neill, BT Utilizing structures of CYP2D6 and BACE1 complexes to reduce risk of drug-drug interactions with a novel series of centrally efficacious BACE1 inhibitors. J Med Chem58:3223-52 (2015) 
 
Beta-secretase 1
Name:Beta-secretase 1
Type:Protein
Mol. Mass.:55755.10
Organism:Homo sapiens (Human)
Description:P56817
Residue:501
BDBM50081646
NameBDBM50081646
Synonyms:CHEMBL3422236
TypeSmall organic molecule
Emp. Form.C17H17F2N3O2S
Mol. Mass.365.398
SMILES[H][C@]12CSC(N)=N[C@]1(CO[C@H](C2)c1nc(C)co1)c1ccc(F)cc1F